{"text_format":"1","workbook":"xlsx","n_sheets":12,"sheets":["Instructions","Application Fact Sheet","Finance and Facilities","Current Year Budgets","MCSO Budget Projections","Governance","Staffing","Enrollment","Checklist","Outputs","Financial Indicators","Error Checking"],"not_rendered":{"charts":0,"images":0,"macros":1,"external_links":0,"defined_names":88,"comments":0,"pivot_tables":0},"unopened":[],"bounds":{"document_bytes":16777216,"sheet_cells":100000,"rows_first":2000,"rows_last":500,"rows_between":2000,"halvings":0,"cell_chars":16384,"cell_head_chars":4096},"cells_cut":0,"cells_raw":0,"read":"whole","date_system":"1900"}

{"sheet":"Instructions","index":0,"n_rows":176,"n_cols":2,"rows_kept":176,"cut":false,"hidden":false,"merged":[[8,0,8,1],[14,0,14,1],[149,0,149,1],[16,0,16,1]]}
[]
["Multiple Charter School Organization (MCSO) Application"]
["Instructions and Definitions"]
[2024]
[]
[]
["Application Instructions"]
[]
["The Multiple Charter School Organization (MCSO) Application contains 11 tabs (including this Instructions tab): The green tabs serve as resources for applicants and assist in completing the application; the yellow tabs contain the components of the application. The black Outputs tab aggregates financial, facilities, and enrollment information entered in the yellow tabs. The black Financial Indicators tab provides authorizers with financial indicators and metrics commonly used by ratings agencies, charter authorizers, and other states to evaluate fiscal management and viability of charter schools. The black tabs do not require any input from the applicant. To fulfill application requirements, please complete all items in each yellow tab and ensure that all items requested in the green Checklist tab are compiled and verified for submission."]
[]
["Please read  instructions and definitions carefully. Questions may be directed to Barbara Clemmer at 717-425-5728 or baclemmer@pa.gov."]
[]
["All cells with a blue background must be completed for the application to be considered complete. If a question does not apply, please enter 0 or N/A."]
[]
["If additional space is needed for any responses to narrative questions, adjust the height of the blue text box cells by clicking and holding down the mouse between row number labels and dragging downward until all text is visible."]
[]
["When all application tabs are complete, return to the Application Fact Sheet tab and click on the \"Application Complete\" button. This button ensures that all blue cells are complete and calculated.  Save the application in the following format: Date of completion then proposed MCSO name (i.e., YYYY-MM-DD_ProposedMCSOName). Consult the MCSO Guide for additional submission instructions. "]
[]
["Application Fact Sheet  (double click to navigate to tab)"]
[]
{"$rows_left_out":157}
{"sheet":"Application Fact Sheet","index":1,"n_rows":56,"n_cols":13,"rows_kept":56,"cut":false,"hidden":false,"merged":[]}
[]
["Multiple Charter School Organization (MCSO) Application"]
["Application Fact Sheet"]
[{"$f":"appyear","v":2024}]
[]
["Please complete all of the information in the blue fields below.  Then hit 'Begin Application' button before moving to Finance and Facilities tab.",null,null,null,null,null,null,null,null,null,null,null,"Requirement Met"]
[null,null,null,null,null,null,null,null,null,null,null,null,"Requirement Not Met"]
["Section 1: Application Fact Sheet"]
[]
["1a. Proposed MCSO Name:"]
[]
["1b. Proposed MCSO EIN:"]
[]
["1c. Proposed MCSO Administrative Location:"]
["Street Address"]
["City/Town and Zip Code"]
[]
["1d. Application Submission Date to Authorizing District(s):"]
[]
["1e. Contact Person:"]
{"$rows_left_out":37}
{"sheet":"Finance and Facilities","index":2,"n_rows":214,"n_cols":6,"rows_kept":214,"cut":false,"hidden":false,"merged":[[203,0,203,6],[186,0,186,6],[167,0,167,6],[114,0,114,6],[100,0,100,6],[171,0,171,6],[146,0,146,6],[139,0,139,6],[137,0,137,6],[117,0,117,6],[130,0,130,6],[134,0,134,6]]}
[]
["Multiple Charter School Organization (MCSO) Application"]
["Finance and Facilities Information"]
[{"$f":"appyear","v":2024}]
[]
[]
["Section 2: Existing Charter School Financial Information"]
[]
["2a. Independent Audit Financial Information "]
["Include three years of independent audits for each participating charter school within the required attachments."]
[]
["Independent Audit data source: Statement of Revenues, Expenditures and Changes in Fund Balance (General Fund)"]
[null,{"$f":"OFFSET(SchoolStart,(COLUMN()-COLUMN($B13))/3,0)","v":0}]
[null,{"$f":"appyear-4","v":2020},{"$f":"appyear-3","v":2021},{"$f":"appyear-2","v":2022}]
[null,"Actual","Actual","Actual"]
["Revenues"]
["Local sources"]
["State sources"]
["Federal sources"]
["Other sources"]
{"$rows_left_out":195}
{"sheet":"Current Year Budgets","index":3,"n_rows":233,"n_cols":3,"rows_kept":233,"cut":false,"hidden":false,"merged":[[9,0,9,2]]}
[]
["Multiple Charter School Organization (MCSO) Application"]
["Current Charter School Budget Detail"]
[{"$f":"appyear","v":2024}]
[]
[]
["Section 6: Current Year Budget Information (General Fund)"]
["Include current year adopted budget information for each participating charter school within the required attachments."]
[]
["For rows labeled \"Multiple\" enter the sum of the remaining revenues or expenditures not accounted for in the budget codes above. "]
[]
["Account Code",null,{"$f":"OFFSET(SchoolStart,(COLUMN()-COLUMN($C12)),0)","v":0}]
[null,null,{"$f":"appyear -1","v":2023}]
[]
[null,"Revenues"]
[6000,"Local Sources"]
[6944,"Receipts from other LEAs in PA "]
[6920,"Contributions from Private Sources"]
["Multiple","All Other Local Sources"]
[6000,"Total Local",{"$f":"SUM(C17:C19)","v":0}]
{"$rows_left_out":214}
{"sheet":"MCSO Budget Projections","index":4,"n_rows":232,"n_cols":7,"rows_kept":232,"cut":false,"hidden":false,"merged":[]}
[]
["Multiple Charter School Organization (MCSO) Application"]
["MCSO 5-Year Budget Information"]
[{"$f":"appyear","v":2024}]
[]
[]
["Section 7: MCSO Five Year Budget Projection (General Fund)"]
["Include multiyear projected budget information for each participating charter school  (if available) as well as any more detailed multiyear budget projections for the MCSO (if available), within the required attachments. "]
[]
["For rows labeled \"Multiple\" enter the sum of the remaining revenues or expenditures not accounted for in the budget codes above. "]
[]
["Account Code",null,{"$f":"appyear","v":2024},{"$f":"C12+1","v":2025},{"$f":"D12+1","v":2026},{"$f":"E12+1","v":2027},{"$f":"F12+1","v":2028}]
[]
[null,"Revenues"]
[6000,"Local Sources"]
[6944,"Receipts from other LEAs in PA "]
[6920,"Contributions from Private Sources"]
["Multiple","All Other Local Sources"]
[6000,"Total Local",{"$f":"SUM(C16:C18)","v":0},{"$f":"SUM(D16:D18)","v":0},0,0,0]
[]
{"$rows_left_out":213}
{"sheet":"Governance","index":5,"n_rows":41,"n_cols":1,"rows_kept":41,"cut":false,"hidden":false,"merged":[[15,0,15,6],[16,0,16,6],[18,0,18,6],[19,0,19,6],[21,0,21,6],[28,0,28,6],[7,0,7,6],[37,0,37,6],[24,0,24,6],[25,0,25,6],[30,0,30,6],[31,0,31,6],[33,0,33,6],[34,0,34,6],[36,0,36,6],[22,0,22,6],[9,0,9,6],[10,0,10,6],[12,0,12,6],[13,0,13,6],[27,0,27,6]]}
[]
["Multiple Charter School Organization (MCSO) Application"]
["Governance Information"]
[{"$f":"appyear","v":2024}]
[]
[]
["Section 8: Governance"]
["If additional space is needed for any of your responses to narrative questions, adjust the height of the text box cells by clicking and holding down the mouse between row number labels for blue cells, and dragging downward until all text is visible."]
[]
["8a. Describe how the proposed merger will affect school governance and operations of the individual charter schools within the proposed MCSO.  Include both benefits and any anticipated challenges. How will the MCSO work to overcome any identified challenges? "]
[]
[]
["8b. Describe the process for the appointment or election of members of the MCSO Board of Trustees. How will appointment or election procedures ensure appropriate representation from individual charter schools? Applicants must include both a listing of proposed Board membership (included as a required attachment) and a clear description of the method for the appointment or election of members of the Board of Trustees. "]
[]
[]
["8c. Describe how will the proposed merger support the Board of Trustees' capacity to govern the charter schools within the MCSO. Applicants must include a clear description of the roles and responsibilities for the Board of Trustees, Chief Administrator, administrators, and any other entities, including a charter school foundation, shown in the organization chart (included as a required attachment)."]
[]
[]
["8d. Describe the roles and responsibilities of the CEO as they pertain to the MCSO and to member schools. Applicants must include a clear description of the roles and responsibilities for the Board of Trustees, Chief Administrator, administrators, and any other entities, including a charter school foundation, shown in the organization chart (included as a required attachment)."]
[]
{"$rows_left_out":22}
{"sheet":"Staffing","index":6,"n_rows":54,"n_cols":6,"rows_kept":54,"cut":false,"hidden":false,"merged":[[7,0,7,6],[49,0,49,6],[50,0,50,6],[9,0,9,6],[25,0,25,6],[43,0,43,6],[45,0,45,6],[46,0,46,6],[27,0,27,6]]}
[]
["Multiple Charter School Organization (MCSO) Application"]
["Staffing Information"]
[{"$f":"appyear","v":2024}]
[]
[]
["Section 9: Staffing"]
["If additional space is needed for any of your responses to narrative questions, adjust the height of the text box cells by clicking and holding down the mouse between row number labels for blue cells, and dragging downward until all text is visible."]
[]
["9a. Provide the number of current full time equivalent (FTE) employees in each category by school. List any additional categories of staff, using the \"Other\" Explanation text box below the table. "]
[]
[null,{"$f":"OFFSET(SchoolStart,COLUMN()-COLUMN($B12),0)","v":0}]
[null,{"$f":"appyear-1","v":2023}]
["Pupil personnel"]
["Instructional personnel"]
["Administration"]
["Business office"]
["Transportation"]
["Pupil Health"]
["Operations and Maintenance"]
{"$rows_left_out":35}
{"sheet":"Enrollment","index":7,"n_rows":121,"n_cols":6,"rows_kept":121,"cut":false,"hidden":false,"merged":[[116,0,116,6],[118,0,118,6],[7,0,7,6],[112,0,112,6],[114,0,114,6],[104,0,104,6],[106,0,106,6],[108,0,108,6],[102,0,102,6],[100,0,100,6],[31,0,31,4],[75,0,75,3],[110,0,110,6],[50,0,50,6],[51,0,51,6]]}
[]
["Multiple Charter School Organization (MCSO) Application"]
["Enrollment Information"]
[{"$f":"appyear","v":2024}]
[]
[]
["Section 10: Enrollment"]
["If additional space is needed for any of your responses to narrative questions, adjust the height of the text box cells by clicking and holding down the mouse between row number labels for blue cells, and dragging downward until all text is visible."]
[]
["10a. Historical and Current Year School Enrollment Information"]
[]
[null,{"$f":"OFFSET(SchoolStart,(COLUMN()-COLUMN($B12))/4,0)","v":0}]
[null,{"$f":"appyear-4","v":2020},{"$f":"appyear-3","v":2021},{"$f":"appyear-2","v":2022},"Current Year to Date"]
["K"]
[1]
[{"$f":"A15+1","v":2}]
[{"$f":"A16+1","v":3}]
[4]
[5]
[6]
{"$rows_left_out":102}
{"sheet":"Checklist","index":8,"n_rows":100,"n_cols":3,"rows_kept":100,"cut":false,"hidden":false,"merged":[]}
[]
["Multiple Charter School Organization (MCSO) Application"]
["Applicant Checklist"]
[{"$f":"appyear","v":2024}]
[]
["Prior to final submission, please ensure you have provided the following documents. "]
[]
[null,"Overview of Proposed Merger"]
[null,null,"Table of Contents - Attached Documents "]
[null,null,"All attached documents must be numbered and listed within the Table of Contents - Attached Documents."]
[null,null,"Executive Summary"]
[null,null,"The executive summary provides an opportunity for the proposed MCSO and participating charter schools to outline key principles underpinning "]
[null,null,"the proposed MCSO.  The formation of an MCSO should be guided by a commitment to equitable, high-quality educational opportunities for students;"]
[null,null,"increased availability of high rigor courses and innovative programming to expand educational opportunity and success; and streamlined governance "]
[null,null,"that promotes transparency and accountability. Specifically, the executive summary must include a reflection upon ways in which the merger may "]
[null,null,"increase educational equity for all students and the anticipated impact upon student achievement and assessment.  "]
[null,null,"Draft Plan of Merger"]
[null,null,"Current curriculum (planned courses by grade level) if not already on file with authorizer(s)"]
[null,null,"Current curriculum is a required submission for any MCSO application requiring approvals from multiple authorizers."]
[null,null,"Current Local Assessment System Plan if not already on file with authorizer(s)"]
{"$rows_left_out":81}
{"sheet":"Outputs","index":9,"n_rows":136,"n_cols":18,"rows_kept":136,"cut":false,"hidden":false,"merged":[[55,0,56,0],[108,0,109,0],[10,0,11,0],[97,0,98,0]]}
[]
["Multiple Charter School Organization (MCSO) Application"]
["Outputs"]
[{"$f":"appyear","v":2024}]
[]
[]
["Financial Indicators"]
[]
[null,{"$f":"IF(B10<>0,B10,A9)","v":0},0,0,0]
[null,{"$f":"OFFSET(SchoolStart,(COLUMN()-COLUMN($B10))/4,0)","v":0},null,null,null,"MCSO Total",null,null,null,null,"Calculation"]
["Indicator",{"$f":"appyear-4","v":2020},{"$f":"appyear-3","v":2021},{"$f":"C11+1","v":2022},{"$f":"D11+1","v":2023},{"$f":"appyear","v":2024},{"$f":"F11+1","v":2025},{"$f":"G11+1","v":2026},{"$f":"H11+1","v":2027},{"$f":"I11+1","v":2028}]
[null,"Actual ","Actual ","Actual","Budget","Projected","Projected","Projected","Projected","Projected"]
["Total Margin Ratio",{"$f":"1-OFFSET(Audit,MATCH('Finance and Facilities'!$A$29,AuditList,0),MATCH(B$9,OFFSET(audityear,-1,0),0))/OFFSET(Audit,MATCH('Finance and Facilities'!$A$21,AuditList,0),MATCH(B$9,OFFSET(audityear,-1,0),0))","v":{"$error":"#DIV/0!"}},{"$f":"1-OFFSET(Audit,MATCH('Finance and Facilities'!$A$29,AuditList,0),MATCH(C$9,OFFSET(audityear,-1,0),0)+1)/OFFSET(Audit,MATCH('Finance and Facilities'!$A$21,AuditList,0),MATCH(C$9,OFFSET(audityear,-1,0),0)+1)","v":{"$error":"#DIV/0!"}},{"$f":"1-OFFSET(Audit,MATCH('Finance and Facilities'!$A$29,AuditList,0),MATCH(D$9,OFFSET(audityear,-1,0),0)+2)/OFFSET(Audit,MATCH('Finance and Facilities'!$A$21,AuditList,0),MATCH(D$9,OFFSET(audityear,-1,0),0)+2)","v":{"$error":"#DIV/0!"}},{"$f":"1-OFFSET(AccSchool,MATCH('Current Year Budgets'!$B$225,List,0)+2,MATCH(E$9,SchoolList,0))/OFFSET(AccSchool,MATCH('Current Year Budgets'!$B$42,List,0)+2,MATCH(E$9,SchoolList,0))","v":{"$error":"#DIV/0!"}},{"$f":"1-'MCSO Budget Projections'!C224/'MCSO Budget Projections'!C41","v":{"$error":"#DIV/0!"}},{"$f":"1-'MCSO Budget Projections'!D224/'MCSO Budget Projections'!D41","v":{"$error":"#DIV/0!"}},{"$f":"1-'MCSO Budget Projections'!E224/'MCSO Budget Projections'!E41","v":{"$error":"#DIV/0!"}},{"$f":"1-'MCSO Budget Projections'!F224/'MCSO Budget Projections'!F41","v":{"$error":"#DIV/0!"}},{"$f":"1-'MCSO Budget Projections'!G224/'MCSO Budget Projections'!G41","v":{"$error":"#DIV/0!"}},"Calculated as net income (revenues-expenditures) / total revenue"]
["Current Ratio",{"$f":"OFFSET(Audit,MATCH('Finance and Facilities'!$A$49,AuditList,0),MATCH(B$9,OFFSET(audityear,-1,0),0))/OFFSET(Audit,MATCH('Finance and Facilities'!$A$54,AuditList,0),MATCH(B$9,OFFSET(audityear,-1,0),0))","v":{"$error":"#DIV/0!"}},{"$f":"OFFSET(Audit,MATCH('Finance and Facilities'!$A$49,AuditList,0),MATCH(C$9,OFFSET(audityear,-1,0),0)+1)/OFFSET(Audit,MATCH('Finance and Facilities'!$A$54,AuditList,0),MATCH(C$9,OFFSET(audityear,-1,0),0)+1)","v":{"$error":"#DIV/0!"}},{"$f":"OFFSET(Audit,MATCH('Finance and Facilities'!$A$49,AuditList,0),MATCH(D$9,OFFSET(audityear,-1,0),0)+2)/OFFSET(Audit,MATCH('Finance and Facilities'!$A$54,AuditList,0),MATCH(D$9,OFFSET(audityear,-1,0),0)+2)","v":{"$error":"#DIV/0!"}},"N/A","N/A","N/A","N/A","N/A","N/A","Calculated as current assets / current liabilities"]
["Liquidity (Days of Cash on Hand)",{"$f":"OFFSET(Audit,MATCH('Finance and Facilities'!$A$46,AuditList,0),MATCH(B$9,OFFSET(audityear,-1,0),0))/365","v":0},{"$f":"OFFSET(Audit,MATCH('Finance and Facilities'!$A$46,AuditList,0),MATCH(C$9,OFFSET(audityear,-1,0),0)+1)/365","v":0},{"$f":"OFFSET(Audit,MATCH('Finance and Facilities'!$A$46,AuditList,0),MATCH(D$9,OFFSET(audityear,-1,0),0)+2)/365","v":0},"N/A","N/A","N/A","N/A","N/A","N/A","Calculated as cash and cash equivalents / 365"]
["Net Position (% of Revenue)",{"$f":"OFFSET(Audit,MATCH('Finance and Facilities'!$A$62,AuditList,0),MATCH(B$9,OFFSET(audityear,-1,0),0))/OFFSET(Audit,MATCH('Finance and Facilities'!$A$21,AuditList,0),MATCH(B$9,OFFSET(audityear,-1,0),0))","v":{"$error":"#DIV/0!"}},{"$f":"OFFSET(Audit,MATCH('Finance and Facilities'!$A$62,AuditList,0),MATCH(C$9,OFFSET(audityear,-1,0),0)+1)/OFFSET(Audit,MATCH('Finance and Facilities'!$A$21,AuditList,0),MATCH(C$9,OFFSET(audityear,-1,0),0)+1)","v":{"$error":"#DIV/0!"}},{"$f":"OFFSET(Audit,MATCH('Finance and Facilities'!$A$62,AuditList,0),MATCH(D$9,OFFSET(audityear,-1,0),0)+2)/OFFSET(Audit,MATCH('Finance and Facilities'!$A$21,AuditList,0),MATCH(D$9,OFFSET(audityear,-1,0),0)+2)","v":{"$error":"#DIV/0!"}},"N/A","N/A","N/A","N/A","N/A","N/A","Calculated as net position / total revenue"]
["Unrestricted Fund Balance\n(Equal to 2+ Months of Expenditures)",{"$f":"IF(OFFSET(Audit,MATCH('Finance and Facilities'!$A$59,AuditList,0),MATCH(B$9,OFFSET(audityear,-1,0),0))>=(OFFSET(Audit,MATCH('Finance and Facilities'!$A$21,AuditList,0),MATCH(B$9,OFFSET(audityear,-1,0),0))/6),\"YES\",\"NO\")","v":"YES"},{"$f":"IF(OFFSET(Audit,MATCH('Finance and Facilities'!$A$59,AuditList,0),MATCH(C$9,OFFSET(audityear,-1,0),0)+1)>=(OFFSET(Audit,MATCH('Finance and Facilities'!$A$21,AuditList,0),MATCH(C$9,OFFSET(audityear,-1,0),0)+1)/6),\"YES\",\"NO\")","v":"YES"},{"$f":"IF(OFFSET(Audit,MATCH('Finance and Facilities'!$A$59,AuditList,0),MATCH(D$9,OFFSET(audityear,-1,0),0)+2)>=(OFFSET(Audit,MATCH('Finance and Facilities'!$A$21,AuditList,0),MATCH(D$9,OFFSET(audityear,-1,0),0)+2)/6),\"YES\",\"NO\")","v":"YES"},{"$f":"IF(OFFSET(AccSchool,MATCH('Current Year Budgets'!$B$231,List,0)+2,MATCH(E$9,SchoolList,0))>=(OFFSET(AccSchool,MATCH('Current Year Budgets'!$B$42,List,0)+2,MATCH(E$9,SchoolList,0))/6),\"YES\",\"NO\")","v":"YES"},{"$f":"IF('MCSO Budget Projections'!C230>=('MCSO Budget Projections'!C41/6),\"YES\",\"NO\")","v":"YES"},{"$f":"IF('MCSO Budget Projections'!D230>=('MCSO Budget Projections'!D41/6),\"YES\",\"NO\")","v":"YES"},{"$f":"IF('MCSO Budget Projections'!E230>=('MCSO Budget Projections'!E41/6),\"YES\",\"NO\")","v":"YES"},{"$f":"IF('MCSO Budget Projections'!F230>=('MCSO Budget Projections'!F41/6),\"YES\",\"NO\")","v":"YES"},{"$f":"IF('MCSO Budget Projections'!G230>=('MCSO Budget Projections'!G41/6),\"YES\",\"NO\")","v":"YES"},"Calculated as fund balance relative to two months of expenditures (if the unrestricted fund balance equals at least two months of expenditures, \"YES\", otherwise \"NO\")"]
["Debt Ratio",{"$f":"OFFSET(Audit,MATCH('Finance and Facilities'!$A$55,AuditList,0),MATCH(B$9,OFFSET(audityear,-1,0),0))/OFFSET(Audit,MATCH('Finance and Facilities'!$A$51,AuditList,0),MATCH(B$9,OFFSET(audityear,-1,0),0))","v":{"$error":"#DIV/0!"}},{"$f":"OFFSET(Audit,MATCH('Finance and Facilities'!$A$55,AuditList,0),MATCH(C$9,OFFSET(audityear,-1,0),0)+1)/OFFSET(Audit,MATCH('Finance and Facilities'!$A$51,AuditList,0),MATCH(C$9,OFFSET(audityear,-1,0),0)+1)","v":{"$error":"#DIV/0!"}},{"$f":"OFFSET(Audit,MATCH('Finance and Facilities'!$A$55,AuditList,0),MATCH(D$9,OFFSET(audityear,-1,0),0)+2)/OFFSET(Audit,MATCH('Finance and Facilities'!$A$51,AuditList,0),MATCH(D$9,OFFSET(audityear,-1,0),0)+2)","v":{"$error":"#DIV/0!"}},"N/A","N/A","N/A","N/A","N/A","N/A","Calculated as total liabilities / total assets"]
[]
["Budget - Actual Comparison "]
{"$rows_left_out":117}
{"sheet":"Financial Indicators","index":10,"n_rows":34,"n_cols":3,"rows_kept":34,"cut":false,"hidden":false,"merged":[[7,0,7,1],[32,0,32,1],[33,0,33,1],[31,0,31,1],[9,0,9,1],[21,0,21,2]]}
[]
["Multiple Charter School Organization (MCSO) Application"]
["Financial Indicator Information"]
[{"$f":"appyear","v":2024}]
[]
[]
[]
["This document has been created to assist authorizers in understanding and aggregating the information contained within the application tool. The financial indicators and associated thresholds provide various metrics that are commonly used by ratings agencies and charter authorizers in the Commonwealth and other states to evaluate the financial viability of charter schools. The outputs and financial indicators provided in the tool should not be interpreted as a determination of a proposed MCSO’s feasibility; instead, they should be viewed as a starting point for evaluation."]
[]
["Financial Indicators in Outputs Sheet"]
["Measure","Recommended Threshold"]
["Total Margin ","Total margin as a percentage of revenue is at least 0%"]
["Current Ratio","Current ratio of at least 100%; preferably 110% or greater"]
["Liquidity (Days of Cash on Hand)","Average of at least 60 days recommended; fewer than 30 days is a flag for concern"]
["Net Position (% of Revenue)","Net position as a percentage of revenue of at least 16.66%; less than 0% is a flag for concern"]
["Unrestricted Fund Balance","Government Finance Officers Association (GFOA) recommends maintaining an unrestricted general fund - fund balance of at least two months of general fund operating revenues or expenditures "]
["Unrestricted Fund Balance (% of Revenue)","Non-restricted fund balance as a percentage of revenue of at least 16.66%; less than 0% is a flag for concern"]
["Debt Ratio","Debt ratio of at most 85%; more than 92% is a flag for concern"]
["Enrollment Growth","S&P considers growth of 2%-5% per year \"Adequate\""]
["Retention ","S&P considers 80%-85% retention \"Adequate\""]
{"$rows_left_out":15}
{"sheet":"Error Checking","index":11,"n_rows":39,"n_cols":4,"rows_kept":39,"cut":false,"hidden":true,"merged":[]}
[null,{"$f":"COUNTA(SchoolList)","v":1}]
[]
[null,"2a",{"$f":"COUNTA(OFFSET(AuditRange,0,0,,3*$B$1))","v":25},{"$f":"1*(C3<61*$B$1)","v":1}]
[null,"2a",{"$f":"COUNTA(OFFSET(NetRange,0,0,,3*$B$1))","v":7},{"$f":"1*(C4<40*$B$1)","v":1}]
[null,"2b",{"$f":"COUNTA(OFFSET(BudgetRange,0,0,,3*$B$1))","v":25},{"$f":"1*(C5<61*$B$1)","v":1}]
[null,"3a",{"$f":"COUNTA(OFFSET(ServiceRange,0,0,,$B$1))","v":1},{"$f":"1*(C6<9*$B$1)","v":1}]
[null,"4a",{"$f":"COUNTA(PolicyRange)","v":2},{"$f":"1*(C7<17*2)","v":1}]
[null,"4b",{"$f":"COUNTA(InsuranceRange)","v":2},{"$f":"1*(C8<22)","v":1}]
[null,"5a",{"$f":"COUNTA(OFFSET(FacilityRange,0,0,,FacilityNum))","v":1},{"$f":"1*(C9<7*FacilityNum)","v":0}]
[null,"5b",{"$f":"COUNTA(ProjFacility)","v":10},{"$f":"1*(C10<30)","v":1}]
[null,6,{"$f":"COUNTA(OFFSET(AccSchoolRange,0,0,,$B$1))","v":26},{"$f":"1*(C11<172*B1)","v":1}]
[null,7,{"$f":"COUNTA(OFFSET(MCSOList,0,1,,5))","v":124},{"$f":"1*(C12<170*5)","v":1}]
[null,"9a",{"$f":"COUNTA(OFFSET(CurrStaffRange,0,0,,$B$1))","v":3},{"$f":"1*(C13<12*$B$1)","v":1}]
[null,"9b",{"$f":"COUNTA(OFFSET(ProjMCSOStaff,0,0,,5*$B$1+5))","v":11},{"$f":"1*(C14<56*($B$1+1))","v":1}]
[null,"3b",{"$f":"COUNTA(MCSOService)","v":1},{"$f":"1*(C15<9)","v":1}]
[null,"10a",{"$f":"COUNTA(OFFSET(EnrollRange,0,0,,4*$B$1))","v":9},{"$f":"1*(C16<73*$B$1)","v":1}]
[null,"10b",{"$f":"COUNTA(OFFSET(SpecialEdRange,0,0,,4*$B$1))","v":9},{"$f":"1*(C17<61*$B$1)","v":1}]
[null,"10d",{"$f":"COUNTA(OFFSET(ProjEnrollRange,0,0,,5*$B$1))","v":11},{"$f":"1*(C18<91*$B$1)","v":1}]
[null,"10e",{"$f":"COUNTA(OFFSET(ProjSpecialEdRange,0,0,,$B$1))","v":3},{"$f":"1*(C19<16*$B$1)","v":1}]
[null,"10f",{"$f":"COUNTA(OFFSET(retentionrange,0,0,,4*$B$1))","v":5},{"$f":"1*(C20<9*$B$1)","v":1}]
{"$rows_left_out":19}